Apply suggestion to src/StudioWindow.cpp

Status Job ID Name Coverage
  Test
failed #4045
build

00:01:19

failed #4044
build

00:01:24

failed #4043
build

00:00:04

failed #4042
build

00:00:04

failed #4041
build

00:00:09

failed #4040
build

00:00:04

failed #4039
build

00:00:09

failed #4038
build

00:00:09

failed #4037
build

00:00:10

failed #4036
build

00:01:23

failed #4035
build

00:00:09

failed #4034
build

failed #4025
build

 
Name Stage Failure
failed
build Test
StudioEditor.h:47:29: note: previous declaration 'OB::Studio::StudioEditorLineWidget* OB::Studio::StudioEditor::lineIndicator'
47 | StudioEditorLineWidget *lineIndicator;
| ^~~~~~~~~~~~~
make[2]: Leaving directory '/builds/Harbynger/openblox-studio/src'
make[2]: *** [Makefile:576: openblox_studio-StudioWindow.o] Error 1
make[1]: *** [Makefile:380: all] Error 2
make[1]: Leaving directory '/builds/Harbynger/openblox-studio/src'
make: *** [Makefile:474: all-recursive] Error 1
ERROR: Job failed: exit code 1